{"text_format":"1","workbook":"xlsx","n_sheets":13,"sheets":["Instructions","Base Budget","Faculty - Temp","New Hires","Stipends","Salary Increases","Sessional Funding Request","Sessional Funding Saving","Payroll Distribution - Download","Cost Center Plan","Transfers - CC","Reconciliation - Detailed","Reconciliation - Summary"],"not_rendered":{"charts":0,"images":55,"macros":1,"external_links":0,"defined_names":14,"comments":0,"pivot_tables":0},"unopened":[],"bounds":{"document_bytes":16777216,"sheet_cells":100000,"rows_first":2000,"rows_last":500,"rows_between":2000,"halvings":0,"cell_chars":16384,"cell_head_chars":4096},"cells_cut":0,"cells_raw":0,"read":"whole","date_system":"1900"}

{"sheet":"Instructions","index":0,"n_rows":695,"n_cols":12,"rows_kept":695,"cut":false,"hidden":false,"merged":[[364,1,367,1],[201,1,204,1],[186,1,190,1],[188,7,189,12],[599,1,602,1],[322,11,325,12],[517,1,520,1],[439,1,440,5],[323,1,325,1],[356,1,359,1],[1,1,1,12],[39,1,42,1],[58,1,61,1],[75,1,78,1],[313,1,315,1],[143,8,146,11],[147,8,149,11],[312,11,321,12]]}
["run"]
[null,"PAYROLL RECONCILIATION"]
[]
[null,"Purpose"]
[null,"1. To ensure faculty/staff are paid correctly (underpaid/overpaid)."]
[null,"2. To ensure Department funding is correct."]
[null,"3. To ensure Faculty/Staff working for department are charged to the account."]
[]
[null,"Tabs"]
[null,"Base Budget"]
{"$rows_left_out":686}
{"sheet":"Base Budget","index":1,"n_rows":145,"n_cols":27,"rows_kept":145,"cut":false,"hidden":false,"merged":[[103,1,103,5],[2,1,2,5],[0,1,0,5],[59,1,59,5]]}
[null,"Base Budget"]
[null,null,null,null,null,null,null,null,null,null,null,null,null,null,null,null,null,null,null,null,null,null,null,null,null,null,"Tenure"]
[null,"Faculty",null,null,null,null,null,null,null,null,null,null,null,null,null,null,null,null,null,null,null,null,null,null,null,null,"Teaching"]
[null,"Name","Personnel No.","Appointment","FTE","Salary 1st May 2022",null,null,null,null,null,null,null,null,null,null,null,null,null,null,null,null,null,null,null,null,"PM"]
[null,null,null,null,null,null,null,null,null,null,null,null,null,null,null,null,null,null,null,null,null,null,null,null,null,null,"USW"]
[]
[]
[]
[]
[]
{"$rows_left_out":136}
{"sheet":"Faculty - Temp","index":2,"n_rows":43,"n_cols":36,"rows_kept":43,"cut":false,"hidden":false,"merged":[[0,1,0,14],[2,1,2,14],[23,1,23,9]]}
[null,"Temporary Faculty Appointments"]
[null,null,null,null,null,null,null,null,null,null,null,null,null,null,null,null,null,null,null,null,null,null,"Yes",null,null,null,null,null,null,null,null,null,null,null,null,"Temp - CLTA's"]
[null,"Existing Faculty - Temp",null,null,null,null,null,null,null,null,null,null,null,null,null,null,null,null,null,null,null,null,"No"]
[null,"Name","Personnel No.","Appointment","FTE","Fiscal Start","Contract Ends","Funding Required (Months)","Salary 1st May","Funding upto Contract End","Contract Renewed? (Yes/No)","FTE Change on Contract Renewal? (Yes/No)","New FTE","Additional Funding Required","Total Funding"]
[null,null,null,null,null,"2022-05-01",null,{"$f":"IFERROR(DATEDIF(F5,G5,\"m\")+1,\" \")","v":" "},null,{"$f":"IFERROR(ROUND(I5/12*H5,0),\" \")","v":" "},null,null,null,{"$f":"IFERROR(IF(AND(K5=\"Yes\",OR(L5=\"No\",L5=\"\")),(I5/12*(12-H5)),IF(AND(K5=\"Yes\",L5=\"Yes\"),((I5/E5*M5)/12*(12-H5)),0)),\" \")","v":0},{"$f":"IFERROR(J5+N5,\" \")","v":" "}]
[null,null,null,null,null,"2022-05-01",null," ",null," ",null,null,null,{"$f":"IFERROR(IF(AND(K6=\"Yes\",OR(L6=\"No\",L6=\"\")),(I6/12*(12-H6)),IF(AND(K6=\"Yes\",L6=\"Yes\"),((I6/E6*M6)/12*(12-H6)),0)),\" \")","v":0}," "]
[null,null,null,null,null,"2022-05-01",null," ",null," ",null,null,null,0," "]
[null,null,null,null,null,"2022-05-01",null,{"$f":"IFERROR(DATEDIF(F8,G8,\"m\")+1,\" \")","v":" "},null,{"$f":"IFERROR(ROUND(I8/12*H8,0),\" \")","v":" "},null,null,null,0,{"$f":"IFERROR(J8+N8,\" \")","v":" "}]
[null,null,null,null,null,"2022-05-01",null,{"$f":"IFERROR(DATEDIF(F9,G9,\"m\")+1,\" \")","v":" "},null,{"$f":"IFERROR(ROUND(I9/12*H9,0),\" \")","v":" "},null,null,null,0,{"$f":"IFERROR(J9+N9,\" \")","v":" "}]
[null,null,null,null,null,"2022-05-01",null," ",null," ",null,null,null,0," "]
{"$rows_left_out":34}
{"sheet":"New Hires","index":3,"n_rows":48,"n_cols":34,"rows_kept":48,"cut":false,"hidden":false,"merged":[[2,1,2,12],[18,1,18,12],[34,1,34,12],[0,1,0,12]]}
[null,"New Hires"]
[null,null,null,null,null,null,null,null,null,null,null,null,null,null,null,null,null,null,null,null,null,null,null,null,null,null,null,null,null,null,null,null,null,"Tenure"]
[null,"Faculty",null,null,null,null,null,null,null,null,null,null,null,null,null,null,null,null,null,null,null,null,null,null,null,null,null,null,null,null,null,null,null,"Teaching"]
[null,"Name","Personnel No.","Appointment","FTE","Start Date","Fiscal Year End","Funding Required (Months)","Hiring Salary","Funding","Adjustment","Total Funding","Comments/Notes",null,null,null,null,null,null,null,null,null,null,null,null,null,null,null,null,null,null,null,null,"PM"]
[null,null,null,null,null,null,"2023-04-30",{"$f":"IF(IFERROR(DATEDIF(F5,G5,\"m\")+1,\" \")=1480,\" \",IFERROR(DATEDIF(F5,G5,\"m\")+1,\" \"))","v":" "},null,{"$f":"IFERROR(I5*H5/12,0)","v":0},null,{"$f":"J5+K5","v":0},null,null,null,null,null,null,null,null,null,null,null,null,null,null,null,null,null,null,null,null,null,"USW"]
[null,null,null,null,null,null,"2023-04-30",{"$f":"IF(IFERROR(DATEDIF(F6,G6,\"m\")+1,\" \")=1480,\" \",IFERROR(DATEDIF(F6,G6,\"m\")+1,\" \"))","v":" "},null,{"$f":"IFERROR(I6*H6/12,0)","v":0},null,{"$f":"J6+K6","v":0}]
[null,null,null,null,null,null,"2023-04-30"," ",null,0,null,0]
[null,null,null,null,null,null,"2023-04-30"," ",null,0,null,0]
[null,null,null,null,null,null,"2023-04-30"," ",null,0,null,0]
[null,null,null,null,null,null,"2023-04-30"," ",null,0,null,0]
{"$rows_left_out":39}
{"sheet":"Stipends","index":4,"n_rows":42,"n_cols":4,"rows_kept":42,"cut":false,"hidden":false,"merged":[[0,1,0,3],[2,1,2,3]]}
[null,"Stipends"]
[]
[null,"Faculty - Other Stipends; Assoc Chair, Personal, etc."]
[null,"Name","Personnel No.","Stipend"]
[]
[]
[]
[]
[]
[]
{"$rows_left_out":33}
{"sheet":"Salary Increases","index":5,"n_rows":207,"n_cols":32,"rows_kept":207,"cut":false,"hidden":false,"merged":[[0,1,0,11],[2,1,2,11],[101,1,101,11],[155,1,155,11]]}
[null,"Salary Increases - PTR/ATB/Anomaly"]
[null,null,null,null,null,null,null,null,null,null,null,null,null,null,null,null,null,null,null,null,null,null,null,null,null,null,null,null,null,null,null,"Tenure"]
[null,"Faculty",null,null,null,null,null,null,null,null,null,null,null,null,null,null,null,null,null,null,null,null,null,null,null,null,null,null,null,null,null,"Teaching"]
[null,"Name","Personnel No.","Appointment","Anomaly",null,"ATB - July 1st","ATB - Flat","Flat Amount","PTR","Special Merit","Total Increment",null,null,null,null,null,null,null,null,null,null,null,null,null,null,null,null,null,null,null,"Temp - CLTA's"]
[null,{"$f":"'Base Budget'!B5","v":0},{"$f":"'Base Budget'!C5","v":0},{"$f":"'Base Budget'!D5","v":0},null,null,null,null,null,null,null,{"$f":"SUM(E5:K5)","v":0},null,null,null,null,null,null,null,null,null,null,null,null,null,null,null,null,null,null,null,"PM"]
[null,{"$f":"'Base Budget'!B6","v":0},{"$f":"'Base Budget'!C6","v":0},{"$f":"'Base Budget'!D6","v":0},null,null,null,null,null,null,null,0,null,null,null,null,null,null,null,null,null,null,null,null,null,null,null,null,null,null,null,"USW"]
[null,{"$f":"'Base Budget'!B7","v":0},{"$f":"'Base Budget'!C7","v":0},{"$f":"'Base Budget'!D7","v":0},null,null,null,null,null,null,null,0]
[null,{"$f":"'Base Budget'!B8","v":0},{"$f":"'Base Budget'!C8","v":0},{"$f":"'Base Budget'!D8","v":0},null,null,null,null,null,null,null,0]
[null,{"$f":"'Base Budget'!B9","v":0},{"$f":"'Base Budget'!C9","v":0},{"$f":"'Base Budget'!D9","v":0},null,null,null,null,null,null,null,0]
[null,{"$f":"'Base Budget'!B10","v":0},{"$f":"'Base Budget'!C10","v":0},{"$f":"'Base Budget'!D10","v":0},null,null,null,null,null,null,null,0]
{"$rows_left_out":198}
{"sheet":"Sessional Funding Request","index":6,"n_rows":156,"n_cols":14,"rows_kept":156,"cut":false,"hidden":false,"merged":[[0,1,0,8],[2,1,2,8]]}
[null,"Sessional Funding"]
[]
[null,"Faculty"]
[null,"Name","Course Code","Course FCE","Personnel No.","Appointment","Overload Stipend","Sessional Lecturer","Course Instructor",null,null,"Unique List","Personnel No.","Appointment"]
[null,null,null,null,null,null,null,null,null,null,null,null,{"$f":"IFERROR(VLOOKUP(L:L,B:I,4,0),\" \")","v":" "},{"$f":"IFERROR(VLOOKUP(L:L,B:I,5,0),\" \")","v":" "}]
[null,null,null,null,null,null,null,null,null,null,null,null," "," "]
[null,null,null,null,null,null,null,null,null,null,null,null," "," "]
[null,null,null,null,null,null,null,null,null,null,null,null," "," "]
[null,null,null,null,null,null,null,null,null,null,null,null," "," "]
[null,null,null,null,null,null,null,null,null,null,null,null," "," "]
{"$rows_left_out":147}
{"sheet":"Sessional Funding Saving","index":7,"n_rows":49,"n_cols":25,"rows_kept":49,"cut":false,"hidden":false,"merged":[[47,1,47,4],[0,1,0,4],[2,1,2,4],[17,1,17,4],[32,1,32,4]]}
[null,"Sessional Funding - Saving"]
[null,null,null,null,null,null,null,null,null,null,null,null,null,null,null,null,null,null,null,null,null,null,null,null,"Tenure"]
[null,"Research/Study/Admin Leave",null,null,null,null,null,null,null,null,null,null,null,null,null,null,null,null,null,null,null,null,null,null,"Teaching"]
[null,"Personnel No.","Last Name","First Name","Salary Saving",null,null,null,null,null,null,null,null,null,null,null,null,null,null,null,null,null,null,null,"Temp - CLTA's"]
[null,null,null,null,null,null,null,null,null,null,null,null,null,null,null,null,null,null,null,null,null,null,null,null,"PM"]
[null,null,null,null,null,null,null,null,null,null,null,null,null,null,null,null,null,null,null,null,null,null,null,null,"USW"]
[]
[]
[]
[]
{"$rows_left_out":40}
{"sheet":"Payroll Distribution - Download","index":8,"n_rows":600,"n_cols":4,"rows_kept":600,"cut":false,"hidden":false,"merged":[]}
["Include/ Exclude (1)","Include/ Exclude (2)","Check","Include/ Exclude (3)"]
[{"$f":"IF(OR(U:U=\"HR-BEN-AP\",U:U=\"HR-BEN-NAP\"),\"Exclude\",IF(U:U=\"\",\"\",\"Include\"))","v":""},{"$f":"IF(AND(G:G=\"\",OR(V:V=\"801010\",V:V=\"801040\",V:V=\"801050\")),\"Include\",IF(V:V=\"\",\"\",\"Exclude\"))","v":""},{"$f":"IF(AND(G:G=\"\",OR(V:V=\"801010\",V:V=\"801015\",V:V=\"801050\",V:V=\"801040\",V:V=\"801160\",V:V=\"801165\",V:V=\"801270\")),(IF(COUNTIF('Reconciliation - Detailed'!C:C,X:X)=0,\"Add\",\"\")),\"\")","v":""},{"$f":"IF(AND(G:G=\"\",OR(V:V=\"801160\",V:V=\"801165\",V:V=\"801270\")),\"Include\",IF(V:V=\"\",\"\",\"Exclude\"))","v":""}]
[{"$f":"IF(OR(U:U=\"HR-BEN-AP\",U:U=\"HR-BEN-NAP\"),\"Exclude\",IF(U:U=\"\",\"\",\"Include\"))","v":""},{"$f":"IF(AND(G:G=\"\",OR(V:V=\"801010\",V:V=\"801040\",V:V=\"801050\")),\"Include\",IF(V:V=\"\",\"\",\"Exclude\"))","v":""},{"$f":"IF(AND(G:G=\"\",OR(V:V=\"801010\",V:V=\"801015\",V:V=\"801050\",V:V=\"801040\",V:V=\"801160\",V:V=\"801165\",V:V=\"801270\")),(IF(COUNTIF('Reconciliation - Detailed'!C:C,X:X)=0,\"Add\",\"\")),\"\")","v":""},{"$f":"IF(AND(G:G=\"\",OR(V:V=\"801160\",V:V=\"801165\",V:V=\"801270\")),\"Include\",IF(V:V=\"\",\"\",\"Exclude\"))","v":""}]
["","",{"$f":"IF(AND(G:G=\"\",OR(V:V=\"801010\",V:V=\"801015\",V:V=\"801050\",V:V=\"801040\",V:V=\"801160\",V:V=\"801165\",V:V=\"801270\")),(IF(COUNTIF('Reconciliation - Detailed'!C:C,X:X)=0,\"Add\",\"\")),\"\")","v":""},""]
["","",{"$f":"IF(AND(G:G=\"\",OR(V:V=\"801010\",V:V=\"801015\",V:V=\"801050\",V:V=\"801040\",V:V=\"801160\",V:V=\"801165\",V:V=\"801270\")),(IF(COUNTIF('Reconciliation - Detailed'!C:C,X:X)=0,\"Add\",\"\")),\"\")","v":""},""]
["","",{"$f":"IF(AND(G:G=\"\",OR(V:V=\"801010\",V:V=\"801015\",V:V=\"801050\",V:V=\"801040\",V:V=\"801160\",V:V=\"801165\",V:V=\"801270\")),(IF(COUNTIF('Reconciliation - Detailed'!C:C,X:X)=0,\"Add\",\"\")),\"\")","v":""},""]
["","",{"$f":"IF(AND(G:G=\"\",OR(V:V=\"801010\",V:V=\"801015\",V:V=\"801050\",V:V=\"801040\",V:V=\"801160\",V:V=\"801165\",V:V=\"801270\")),(IF(COUNTIF('Reconciliation - Detailed'!C:C,X:X)=0,\"Add\",\"\")),\"\")","v":""},""]
["","",{"$f":"IF(AND(G:G=\"\",OR(V:V=\"801010\",V:V=\"801015\",V:V=\"801050\",V:V=\"801040\",V:V=\"801160\",V:V=\"801165\",V:V=\"801270\")),(IF(COUNTIF('Reconciliation - Detailed'!C:C,X:X)=0,\"Add\",\"\")),\"\")","v":""},""]
["","",{"$f":"IF(AND(G:G=\"\",OR(V:V=\"801010\",V:V=\"801015\",V:V=\"801050\",V:V=\"801040\",V:V=\"801160\",V:V=\"801165\",V:V=\"801270\")),(IF(COUNTIF('Reconciliation - Detailed'!C:C,X:X)=0,\"Add\",\"\")),\"\")","v":""},""]
["","",{"$f":"IF(AND(G:G=\"\",OR(V:V=\"801010\",V:V=\"801015\",V:V=\"801050\",V:V=\"801040\",V:V=\"801160\",V:V=\"801165\",V:V=\"801270\")),(IF(COUNTIF('Reconciliation - Detailed'!C:C,X:X)=0,\"Add\",\"\")),\"\")","v":""},""]
{"$rows_left_out":591}
{"sheet":"Cost Center Plan","index":9,"n_rows":117,"n_cols":28,"rows_kept":117,"cut":false,"hidden":false,"merged":[[0,1,0,6],[2,1,2,6]]}
[null,"Cost Center Plan"]
[null,null,null,null,null,null,null,null,null,null,null,null,null,null,null,null,null,null,null,null,null,null,null,null,null,null,null,"Tenure"]
[null,"FIS",null,null,null,null,null,null,null,null,null,null,null,null,null,null,null,null,null,null,null,null,null,null,null,null,null,"Teaching"]
[null,"GL",null,null,"Plan Version 1","Transfers","Plan Version 0","Remove GL from List",null,null,null,null,null,null,null,null,null,null,null,null,null,null,null,null,null,null,null,"Temp - CLTA's"]
[null,null,{"$f":"LEFT(B5,9)","v":""},{"$f":"IFERROR(SUMPRODUCT(MID(0&B5, LARGE(INDEX(ISNUMBER(--MID(B5, ROW(INDIRECT(\"1:\"&LEN(B5))), 1)) * ROW(INDIRECT(\"1:\"&LEN(B5))), 0), ROW(INDIRECT(\"1:\"&LEN(B5))))+1, 1) * 10^ROW(INDIRECT(\"1:\"&LEN(B5)))/10),\"\")","v":""},null,{"$f":"IFERROR(SUMIFS('Transfers - CC'!D:D,'Transfers - CC'!B:B,'Cost Center Plan'!D5)-'Cost Center Plan'!E5,\" \")","v":0},{"$f":"IFERROR(E5+F5,\" \")","v":0},{"$f":"IF(D5=899041,\"Remove\",\" \")","v":" "},null,null,null,null,null,null,null,null,null,null,null,null,null,null,null,null,null,null,null,"PM"]
[null,null,"",{"$f":"IFERROR(SUMPRODUCT(MID(0&B6, LARGE(INDEX(ISNUMBER(--MID(B6, ROW(INDIRECT(\"1:\"&LEN(B6))), 1)) * ROW(INDIRECT(\"1:\"&LEN(B6))), 0), ROW(INDIRECT(\"1:\"&LEN(B6))))+1, 1) * 10^ROW(INDIRECT(\"1:\"&LEN(B6)))/10),\"\")","v":""},null,{"$f":"IFERROR(SUMIFS('Transfers - CC'!D:D,'Transfers - CC'!B:B,'Cost Center Plan'!D6)-'Cost Center Plan'!E6,\" \")","v":0},0,{"$f":"IF(D6=899041,\"Remove\",\" \")","v":" "},null,null,null,null,null,null,null,null,null,null,null,null,null,null,null,null,null,null,null,"USW"]
[null,null,"","",null,{"$f":"IFERROR(SUMIFS('Transfers - CC'!D:D,'Transfers - CC'!B:B,'Cost Center Plan'!D7)-'Cost Center Plan'!E7,\" \")","v":0},0," "]
[null,null,"","",null,{"$f":"IFERROR(SUMIFS('Transfers - CC'!D:D,'Transfers - CC'!B:B,'Cost Center Plan'!D8)-'Cost Center Plan'!E8,\" \")","v":0},0," "]
[null,null,"","",null,{"$f":"IFERROR(SUMIFS('Transfers - CC'!D:D,'Transfers - CC'!B:B,'Cost Center Plan'!D9)-'Cost Center Plan'!E9,\" \")","v":0},0," "]
[null,null,"","",null,{"$f":"IFERROR(SUMIFS('Transfers - CC'!D:D,'Transfers - CC'!B:B,'Cost Center Plan'!D10)-'Cost Center Plan'!E10,\" \")","v":0},0," "]
{"$rows_left_out":108}
{"sheet":"Transfers - CC","index":10,"n_rows":600,"n_cols":26,"rows_kept":600,"cut":false,"hidden":false,"merged":[[0,1,0,4],[2,1,2,4]]}
[null,"Transfers - Cost Center Plan"]
[null,null,null,null,null,null,null,null,null,null,null,null,null,null,null,null,null,null,null,null,null,null,null,null,null,"Tenure"]
[null,"Transfers",null,null,null,null,null,null,null,null,null,null,null,null,null,null,null,null,null,null,null,null,null,null,null,"Teaching"]
[null,"Cost Element","Cost Element Description","Plan Amount","Plan Long Text","Add GL to CC Plan Tab",null,null,null,null,null,null,null,null,null,null,null,null,null,null,null,null,null,null,null,"Temp - CLTA's"]
[null,null,null,null,null,{"$f":"IF(B5<>\"\",IF(COUNTIF('Cost Center Plan'!D:D,'Transfers - CC'!B5)=0,\"Add\",\" \"),\"\")","v":""},null,null,null,null,null,null,null,null,null,null,null,null,null,null,null,null,null,null,null,"PM"]
[null,null,null,null,null,{"$f":"IF(B6<>\"\",IF(COUNTIF('Cost Center Plan'!D:D,'Transfers - CC'!B6)=0,\"Add\",\" \"),\"\")","v":""},null,null,null,null,null,null,null,null,null,null,null,null,null,null,null,null,null,null,null,"USW"]
[null,null,null,null,null,{"$f":"IF(B7<>\"\",IF(COUNTIF('Cost Center Plan'!D:D,'Transfers - CC'!B7)=0,\"Add\",\" \"),\"\")","v":""}]
[null,null,null,null,null,{"$f":"IF(B8<>\"\",IF(COUNTIF('Cost Center Plan'!D:D,'Transfers - CC'!B8)=0,\"Add\",\" \"),\"\")","v":""}]
[null,null,null,null,null,{"$f":"IF(B9<>\"\",IF(COUNTIF('Cost Center Plan'!D:D,'Transfers - CC'!B9)=0,\"Add\",\" \"),\"\")","v":""}]
[null,null,null,null,null,{"$f":"IF(B10<>\"\",IF(COUNTIF('Cost Center Plan'!D:D,'Transfers - CC'!B10)=0,\"Add\",\" \"),\"\")","v":""}]
{"$rows_left_out":591}
{"sheet":"Reconciliation - Detailed","index":11,"n_rows":262,"n_cols":34,"rows_kept":262,"cut":false,"hidden":false,"merged":[[210,1,210,15],[0,1,0,15],[2,1,2,15],[101,1,101,15],[155,1,155,15]]}
[null,"Reconciliation - Detailed"]
[null,null,null,null,null,null,null,null,null,null,null,null,null,null,null,null,null,null,null,null,null,null,null,null,null,null,null,null,null,null,null,null,null,"Tenure"]
[null,"Faculty",null,null,null,null,null,null,null,null,null,null,null,null,null,null,null,null,null,null,null,null,null,null,null,null,null,null,null,null,null,null,null,"Teaching"]
[null,"Name","Personnel No.","Appointment","Base Budget","Stipends","Transfers","10/12 Increment","Sessional Saving","Adjustment","Total Funding","Payroll Distribution","Forecast","Expected Transfers","Variance","Comments",null,null,null,null,null,null,null,null,null,null,null,null,null,null,null,null,null,"Temp - CLTA's"]
[null,{"$f":"'Base Budget'!B5","v":0},{"$f":"'Base Budget'!C5","v":0},{"$f":"'Base Budget'!D5","v":0},{"$f":"'Base Budget'!F5","v":0},{"$f":"SUMIFS(Stipends!D:D,Stipends!C:C,'Reconciliation - Detailed'!C5)","v":0},null,{"$f":"'Salary Increases'!E5+(SUM('Salary Increases'!F5:K5)/12*10)","v":0},{"$f":"-SUMIFS('Sessional Funding Saving'!E:E,'Sessional Funding Saving'!B:B,'Reconciliation - Detailed'!C5)","v":0},null,{"$f":"SUM(E5:J5)","v":0},{"$f":"SUMIFS('Payroll Distribution - Download'!AG:AG,'Payroll Distribution - Download'!X:X,'Reconciliation - Detailed'!C:C,'Payroll Distribution - Download'!A:A,\"Include\",'Payroll Distribution - Download'!B:B,\"Include\",'Payroll Distribution - Download'!V:V,\"801010\")","v":0},null,null,{"$f":"K5-L5-M5+N5","v":0},null,null,null,null,null,null,null,null,null,null,null,null,null,null,null,null,null,null,"PM"]
[null,{"$f":"'Base Budget'!B6","v":0},{"$f":"'Base Budget'!C6","v":0},{"$f":"'Base Budget'!D6","v":0},{"$f":"'Base Budget'!F6","v":0},{"$f":"SUMIFS(Stipends!D:D,Stipends!C:C,'Reconciliation - Detailed'!C6)","v":0},null,{"$f":"'Salary Increases'!E6+(SUM('Salary Increases'!F6:K6)/12*10)","v":0},{"$f":"-SUMIFS('Sessional Funding Saving'!E:E,'Sessional Funding Saving'!B:B,'Reconciliation - Detailed'!C6)","v":0},null,{"$f":"SUM(E6:J6)","v":0},{"$f":"SUMIFS('Payroll Distribution - Download'!AG:AG,'Payroll Distribution - Download'!X:X,'Reconciliation - Detailed'!C:C,'Payroll Distribution - Download'!A:A,\"Include\",'Payroll Distribution - Download'!B:B,\"Include\",'Payroll Distribution - Download'!V:V,\"801010\")","v":0},null,null,{"$f":"K6-L6-M6+N6","v":0},null,null,null,null,null,null,null,null,null,null,null,null,null,null,null,null,null,null,"USW"]
[null,{"$f":"'Base Budget'!B7","v":0},{"$f":"'Base Budget'!C7","v":0},{"$f":"'Base Budget'!D7","v":0},{"$f":"'Base Budget'!F7","v":0},{"$f":"SUMIFS(Stipends!D:D,Stipends!C:C,'Reconciliation - Detailed'!C7)","v":0},null,{"$f":"'Salary Increases'!E7+(SUM('Salary Increases'!F7:K7)/12*10)","v":0},{"$f":"-SUMIFS('Sessional Funding Saving'!E:E,'Sessional Funding Saving'!B:B,'Reconciliation - Detailed'!C7)","v":0},null,0,{"$f":"SUMIFS('Payroll Distribution - Download'!AG:AG,'Payroll Distribution - Download'!X:X,'Reconciliation - Detailed'!C:C,'Payroll Distribution - Download'!A:A,\"Include\",'Payroll Distribution - Download'!B:B,\"Include\",'Payroll Distribution - Download'!V:V,\"801010\")","v":0},null,null,0]
[null,{"$f":"'Base Budget'!B8","v":0},{"$f":"'Base Budget'!C8","v":0},{"$f":"'Base Budget'!D8","v":0},{"$f":"'Base Budget'!F8","v":0},{"$f":"SUMIFS(Stipends!D:D,Stipends!C:C,'Reconciliation - Detailed'!C8)","v":0},null,{"$f":"'Salary Increases'!E8+(SUM('Salary Increases'!F8:K8)/12*10)","v":0},{"$f":"-SUMIFS('Sessional Funding Saving'!E:E,'Sessional Funding Saving'!B:B,'Reconciliation - Detailed'!C8)","v":0},null,0,{"$f":"SUMIFS('Payroll Distribution - Download'!AG:AG,'Payroll Distribution - Download'!X:X,'Reconciliation - Detailed'!C:C,'Payroll Distribution - Download'!A:A,\"Include\",'Payroll Distribution - Download'!B:B,\"Include\",'Payroll Distribution - Download'!V:V,\"801010\")","v":0},null,null,0]
[null,{"$f":"'Base Budget'!B9","v":0},{"$f":"'Base Budget'!C9","v":0},{"$f":"'Base Budget'!D9","v":0},{"$f":"'Base Budget'!F9","v":0},{"$f":"SUMIFS(Stipends!D:D,Stipends!C:C,'Reconciliation - Detailed'!C9)","v":0},null,{"$f":"'Salary Increases'!E9+(SUM('Salary Increases'!F9:K9)/12*10)","v":0},{"$f":"-SUMIFS('Sessional Funding Saving'!E:E,'Sessional Funding Saving'!B:B,'Reconciliation - Detailed'!C9)","v":0},null,0,{"$f":"SUMIFS('Payroll Distribution - Download'!AG:AG,'Payroll Distribution - Download'!X:X,'Reconciliation - Detailed'!C:C,'Payroll Distribution - Download'!A:A,\"Include\",'Payroll Distribution - Download'!B:B,\"Include\",'Payroll Distribution - Download'!V:V,\"801010\")","v":0},null,null,0]
[null,{"$f":"'Base Budget'!B10","v":0},{"$f":"'Base Budget'!C10","v":0},{"$f":"'Base Budget'!D10","v":0},{"$f":"'Base Budget'!F10","v":0},{"$f":"SUMIFS(Stipends!D:D,Stipends!C:C,'Reconciliation - Detailed'!C10)","v":0},null,{"$f":"'Salary Increases'!E10+(SUM('Salary Increases'!F10:K10)/12*10)","v":0},{"$f":"-SUMIFS('Sessional Funding Saving'!E:E,'Sessional Funding Saving'!B:B,'Reconciliation - Detailed'!C10)","v":0},null,0,{"$f":"SUMIFS('Payroll Distribution - Download'!AG:AG,'Payroll Distribution - Download'!X:X,'Reconciliation - Detailed'!C:C,'Payroll Distribution - Download'!A:A,\"Include\",'Payroll Distribution - Download'!B:B,\"Include\",'Payroll Distribution - Download'!V:V,\"801010\")","v":0},null,null,0]
{"$rows_left_out":253}
{"sheet":"Reconciliation - Summary","index":12,"n_rows":137,"n_cols":10,"rows_kept":137,"cut":false,"hidden":false,"merged":[[2,1,2,9],[0,1,0,9]]}
[null,"Reconciliation - Summary"]
[]
[null,"General Ledger Variance - Budget vs Actual"]
[null,"GL",null,"Budget","Actual (Payroll Distribution)","Forecast","Anticipated Total Fiscal Year","Expected Transfers","Variance","Comments"]
[null,"800100 Comp: Acad: General",{"$f":"LEFT(B5,6)","v":"800100"},{"$f":"SUMIFS('Cost Center Plan'!$G:$G,'Cost Center Plan'!$D:$D,'Reconciliation - Summary'!C5)","v":0},{"$f":"SUMIFS('Payroll Distribution - Download'!$AG:$AG,'Payroll Distribution - Download'!$V:$V,'Reconciliation - Summary'!C5)","v":0},null,{"$f":"E5+F5","v":0},null,{"$f":"D5-G5+H5","v":0}]
[null,"800101 Comp:Faculty Renewal",{"$f":"LEFT(B6,6)","v":"800101"},{"$f":"SUMIFS('Cost Center Plan'!$G:$G,'Cost Center Plan'!$D:$D,'Reconciliation - Summary'!C6)","v":0},{"$f":"SUMIFS('Payroll Distribution - Download'!$AG:$AG,'Payroll Distribution - Download'!$V:$V,'Reconciliation - Summary'!C6)","v":0},null,{"$f":"E6+F6","v":0},null,{"$f":"D6-G6+H6","v":0}]
[null,"800103 Academic Salary recoveries:T&R(Fac of Medicine)","800103",{"$f":"SUMIFS('Cost Center Plan'!$G:$G,'Cost Center Plan'!$D:$D,'Reconciliation - Summary'!C7)","v":0},{"$f":"SUMIFS('Payroll Distribution - Download'!$AG:$AG,'Payroll Distribution - Download'!$V:$V,'Reconciliation - Summary'!C7)","v":0},null,0,null,0]
[null,"800104 Comp:Ac:FT Fully Recov'd","800104",{"$f":"SUMIFS('Cost Center Plan'!$G:$G,'Cost Center Plan'!$D:$D,'Reconciliation - Summary'!C8)","v":0},{"$f":"SUMIFS('Payroll Distribution - Download'!$AG:$AG,'Payroll Distribution - Download'!$V:$V,'Reconciliation - Summary'!C8)","v":0},null,0,null,0]
[null,"800105 Comp:Ac:PT Fully Recov'd","800105",{"$f":"SUMIFS('Cost Center Plan'!$G:$G,'Cost Center Plan'!$D:$D,'Reconciliation - Summary'!C9)","v":0},{"$f":"SUMIFS('Payroll Distribution - Download'!$AG:$AG,'Payroll Distribution - Download'!$V:$V,'Reconciliation - Summary'!C9)","v":0},null,0,null,0]
[null,"800106 Comp:Ac:Administr.Stipend","800106",{"$f":"SUMIFS('Cost Center Plan'!$G:$G,'Cost Center Plan'!$D:$D,'Reconciliation - Summary'!C10)","v":0},{"$f":"SUMIFS('Payroll Distribution - Download'!$AG:$AG,'Payroll Distribution - Download'!$V:$V,'Reconciliation - Summary'!C10)","v":0},null,0,null,0]
{"$rows_left_out":127}